Reaction Details
TargetScavenger receptor class B member 1
LigandBDBM50159533
Substrate/Competitorn/a
Meas. Tech.ChEMBL_1569538 (CHEMBL3789894)
IC50 50±n/a nM
Citation Sparks, SMZhou, HGeneraux, CHarston, LMoncol, DJayawickreme, CParham, JCondreay, PRimele, T Identification of nonabsorbable inhibitors of the scavenger receptor-BI (SR-BI) for tissue-specific administration. Bioorg Med Chem Lett26:1901-4 (2016) 
 
Scavenger receptor class B member 1
Name:Scavenger receptor class B member 1
Type:PROTEIN
Mol. Mass.:60889.81
Organism:Homo sapiens (Human)
Description:ChEMBL_872680
Residue:552
BDBM50159533
NameBDBM50159533
Synonyms:CHEMBL3786653
TypeSmall organic molecule
Emp. Form.C28H34N4O7S
Mol. Mass.570.657
SMILESCOc1c(NC(=O)C(=O)c2ccc(OCCNC(=O)CN)c3ccccc23)cc(cc1NS(C)(=O)=O)C(C)(C)C