Reaction Details
TargetScavenger receptor class B member 1
LigandBDBM50159545
Substrate/Competitorn/a
Meas. Tech.ChEMBL_1569538 (CHEMBL3789894)
IC50 50±n/a nM
Citation Sparks, SMZhou, HGeneraux, CHarston, LMoncol, DJayawickreme, CParham, JCondreay, PRimele, T Identification of nonabsorbable inhibitors of the scavenger receptor-BI (SR-BI) for tissue-specific administration. Bioorg Med Chem Lett26:1901-4 (2016) 
 
Scavenger receptor class B member 1
Name:Scavenger receptor class B member 1
Type:PROTEIN
Mol. Mass.:60889.81
Organism:Homo sapiens (Human)
Description:ChEMBL_872680
Residue:552
BDBM50159545
NameBDBM50159545
Synonyms:CHEMBL3785828
TypeSmall organic molecule
Emp. Form.C32H41N3O7S
Mol. Mass.611.749
SMILESCOc1c(NC(=O)C(=O)c2ccc(OCCCCN3CCOCC3)c3ccccc23)cc(cc1NS(C)(=O)=O)C(C)(C)C