Reaction Details
TargetScavenger receptor class B member 1
LigandBDBM50159549
Substrate/Competitorn/a
Meas. Tech.ChEMBL_1569538 (CHEMBL3789894)
IC50 5012±n/a nM
Citation Sparks, SMZhou, HGeneraux, CHarston, LMoncol, DJayawickreme, CParham, JCondreay, PRimele, T Identification of nonabsorbable inhibitors of the scavenger receptor-BI (SR-BI) for tissue-specific administration. Bioorg Med Chem Lett26:1901-4 (2016) 
 
Scavenger receptor class B member 1
Name:Scavenger receptor class B member 1
Type:PROTEIN
Mol. Mass.:60889.81
Organism:Homo sapiens (Human)
Description:ChEMBL_872680
Residue:552
BDBM50159549
NameBDBM50159549
Synonyms:CHEMBL3786247
TypeSmall organic molecule
Emp. Form.C36H46N4O11S
Mol. Mass.742.836
SMILESCOc1c(NC(=O)C(=O)c2ccc(OCCN3CCOCC3)c3ccccc23)cc(cc1NS(=O)(=O)CCCN(CC(O)=O)CC(O)=O)C(C)(C)C