Reaction Details
TargetScavenger receptor class B member 1
LigandBDBM50159555
Substrate/Competitorn/a
Meas. Tech.ChEMBL_1569538 (CHEMBL3789894)
IC50 1000±n/a nM
Citation Sparks, SMZhou, HGeneraux, CHarston, LMoncol, DJayawickreme, CParham, JCondreay, PRimele, T Identification of nonabsorbable inhibitors of the scavenger receptor-BI (SR-BI) for tissue-specific administration. Bioorg Med Chem Lett26:1901-4 (2016) 
 
Scavenger receptor class B member 1
Name:Scavenger receptor class B member 1
Type:PROTEIN
Mol. Mass.:60889.81
Organism:Homo sapiens (Human)
Description:ChEMBL_872680
Residue:552
BDBM50159555
NameBDBM50159555
Synonyms:CHEMBL3787277
TypeSmall organic molecule
Emp. Form.C32H39N3O8S
Mol. Mass.625.732
SMILESCOc1c(NC(=O)C(=O)c2ccc(OCCN3CCC(CC3)C(O)=O)c3ccccc23)cc(cc1NS(C)(=O)=O)C(C)(C)C