Reaction Details
TargetScavenger receptor class B member 1
LigandBDBM50159556
Substrate/Competitorn/a
Meas. Tech.ChEMBL_1569538 (CHEMBL3789894)
IC50 79±n/a nM
Citation Sparks, SMZhou, HGeneraux, CHarston, LMoncol, DJayawickreme, CParham, JCondreay, PRimele, T Identification of nonabsorbable inhibitors of the scavenger receptor-BI (SR-BI) for tissue-specific administration. Bioorg Med Chem Lett26:1901-4 (2016) 
 
Scavenger receptor class B member 1
Name:Scavenger receptor class B member 1
Type:PROTEIN
Mol. Mass.:60889.81
Organism:Homo sapiens (Human)
Description:ChEMBL_872680
Residue:552
BDBM50159556
NameBDBM50159556
Synonyms:CHEMBL3785219
TypeSmall organic molecule
Emp. Form.C30H39N3O8S
Mol. Mass.601.711
SMILESCOc1c(NC(=O)C(=O)c2ccc(OCCN(CCO)CCO)c3ccccc23)cc(cc1NS(C)(=O)=O)C(C)(C)C