Reaction Details
TargetProteasome subunit beta type-5
LigandBDBM50160867
Substrate/Competitorn/a
Meas. Tech.ChEMBL_1567337 (CHEMBL3789477)
IC50 1.2±n/a nM
Citation Shi, JLei, MWu, WFeng, HWang, JChen, SZhu, YHu, SLiu, ZJiang, C Design, synthesis and docking studies of novel dipeptidyl boronic acid proteasome inhibitors constructed fromaa- andaß-amino acids. Bioorg Med Chem Lett26:1958-62 (2016) 
 
Proteasome subunit beta type-5
Name:Proteasome subunit beta type-5
Type:Protein
Mol. Mass.:28480.96
Organism:Homo sapiens (Human)
Description:n/a
Residue:263
BDBM50160867
NameBDBM50160867
Synonyms:CHEMBL499361
TypeSmall organic molecule
Emp. Form.C25H33BN2O4
Mol. Mass.436.352
SMILESCC(C)C[C@H](NC(=O)[C@H](Cc1ccccc1)NC(=O)[C@H]1CCCc2ccccc12)B(O)O