Reaction Details
TargetCarbonic anhydrase 2
LigandBDBM50161482
Substrate/Competitorn/a
Meas. Tech.ChEMBL_1567400 (CHEMBL3789778)
IC50 60±n/a nM
Citation Özgeris, BGöksu, SPolat Köse, LGülçin, ISalmas, REDurdagi, STümer, FSupuran, CT Acetylcholinesterase and carbonic anhydrase inhibitory properties of novel urea and sulfamide derivatives incorporating dopaminergic 2-aminotetralin scaffolds. Bioorg Med Chem24:2318-29 (2016) 
 
Carbonic anhydrase 2
Name:Carbonic anhydrase 2
Type:Enzyme
Mol. Mass.:29250.71
Organism:Homo sapiens (Human)
Description:P00918
Residue:260
BDBM50161482
NameBDBM50161482
Synonyms:CHEMBL3785207
TypeSmall organic molecule
Emp. Form.C13H18N2O2
Mol. Mass.234.2942
SMILESCN(C)C(=O)N[C@H]1CCc2ccc(O)cc2C1