Reaction Details
TargetAcetylcholinesterase
LigandBDBM50161486
Substrate/Competitorn/a
Meas. Tech.ChEMBL_1567401 (CHEMBL3789779)
IC50 22±n/a nM
Citation Özgeris, BGöksu, SPolat Köse, LGülçin, ISalmas, REDurdagi, STümer, FSupuran, CT Acetylcholinesterase and carbonic anhydrase inhibitory properties of novel urea and sulfamide derivatives incorporating dopaminergic 2-aminotetralin scaffolds. Bioorg Med Chem24:2318-29 (2016) 
 
Acetylcholinesterase
Name:Acetylcholinesterase
Type:Enzyme
Mol. Mass.:67792.70
Organism:Homo sapiens (Human)
Description:P22303
Residue:614
BDBM50161486
NameBDBM50161486
Synonyms:CHEMBL3787502
TypeSmall organic molecule
Emp. Form.C14H20N2O2
Mol. Mass.248.3208
SMILESCOc1ccc2CC[C@@H](Cc2c1)NC(=O)N(C)C