Reaction Details
TargetAcetylcholinesterase
LigandBDBM50161481
Substrate/Competitorn/a
Meas. Tech.ChEMBL_1567401 (CHEMBL3789779)
IC50 7.2±n/a nM
Citation Özgeris, BGöksu, SPolat Köse, LGülçin, ISalmas, REDurdagi, STümer, FSupuran, CT Acetylcholinesterase and carbonic anhydrase inhibitory properties of novel urea and sulfamide derivatives incorporating dopaminergic 2-aminotetralin scaffolds. Bioorg Med Chem24:2318-29 (2016) 
 
Acetylcholinesterase
Name:Acetylcholinesterase
Type:Enzyme
Mol. Mass.:67792.70
Organism:Homo sapiens (Human)
Description:P22303
Residue:614
BDBM50161481
NameBDBM50161481
Synonyms:CHEMBL3785391
TypeSmall organic molecule
Emp. Form.C13H18N2O2
Mol. Mass.234.2942
SMILESCN(C)C(=O)NC1CCc2cc(O)ccc2C1