Reaction Details
TargetCarbonic anhydrase 1
LigandBDBM50161491
Substrate/Competitorn/a
Meas. Tech.ChEMBL_1567402 (CHEMBL3789780)
Ki 3.7±n/a nM
Citation Özgeris, BGöksu, SPolat Köse, LGülçin, ISalmas, REDurdagi, STümer, FSupuran, CT Acetylcholinesterase and carbonic anhydrase inhibitory properties of novel urea and sulfamide derivatives incorporating dopaminergic 2-aminotetralin scaffolds. Bioorg Med Chem24:2318-29 (2016) 
 
Carbonic anhydrase 1
Name:Carbonic anhydrase 1
Type:Enzyme
Mol. Mass.:28873.37
Organism:Homo sapiens (Human)
Description:P00915
Residue:261
BDBM50161491
NameBDBM50161491
Synonyms:CHEMBL3786651
TypeSmall organic molecule
Emp. Form.C14H20N2O2
Mol. Mass.248.3208
SMILESCOc1cccc2C[C@H](CCc12)NC(=O)N(C)C