Reaction Details
TargetCarbonic anhydrase 1
LigandBDBM50161482
Substrate/Competitorn/a
Meas. Tech.ChEMBL_1567402 (CHEMBL3789780)
Ki 3.4±n/a nM
Citation Özgeris, BGöksu, SPolat Köse, LGülçin, ISalmas, REDurdagi, STümer, FSupuran, CT Acetylcholinesterase and carbonic anhydrase inhibitory properties of novel urea and sulfamide derivatives incorporating dopaminergic 2-aminotetralin scaffolds. Bioorg Med Chem24:2318-29 (2016) 
 
Carbonic anhydrase 1
Name:Carbonic anhydrase 1
Type:Enzyme
Mol. Mass.:28873.37
Organism:Homo sapiens (Human)
Description:P00915
Residue:261
BDBM50161482
NameBDBM50161482
Synonyms:CHEMBL3785207
TypeSmall organic molecule
Emp. Form.C13H18N2O2
Mol. Mass.234.2942
SMILESCN(C)C(=O)N[C@H]1CCc2ccc(O)cc2C1