Reaction Details
TargetPeptidyl-prolyl cis-trans isomerase FKBP5
LigandBDBM50162659
Substrate/Competitorn/a
Meas. Tech.ChEMBL_1570257 (CHEMBL3795199)
Ki 2200±n/a nM
Citation Gaali, SFeng, XHähle, ASippel, CBracher, AHausch, F Rapid, Structure-Based Exploration of Pipecolic Acid Amides as Novel Selective Antagonists of the FK506-Binding Protein 51. J Med Chem59:2410-22 (2016) 
 
Peptidyl-prolyl cis-trans isomerase FKBP5
Name:Peptidyl-prolyl cis-trans isomerase FKBP5
Type:PROTEIN
Mol. Mass.:51207.06
Organism:Homo sapiens (Human)
Description:ChEMBL_952910
Residue:457
BDBM50162659
NameBDBM50162659
Synonyms:CHEMBL3793853
TypeSmall organic molecule
Emp. Form.C27H41N3O6
Mol. Mass.503.6309
SMILESCOc1cc(cc(OC)c1OC)[C@H](C1CCCCC1)C(=O)N1CCCC[C@H]1C(=O)NC(C)(C)C(N)=O