Reaction Details
TargetPresenilin-1
LigandBDBM50163314
Substrate/Competitorn/a
Meas. Tech.ChEMBL_1570813 (CHEMBL3795240)
IC50 120±n/a nM
Citation Lu, DWei, HXZhang, JGu, YOsenkowski, PYe, WSelkoe, DJWolfe, MSAugelli-Szafran, CE Part 1: Notch-sparing¿-secretase inhibitors: The identification of novel naphthyl and benzofuranyl amide analogs. Bioorg Med Chem Lett26:2129-32 (2016) 
 
Presenilin-1
Name:Presenilin-1
Type:n/a
Mol. Mass.:52657.13
Organism:Homo sapiens (Human)
Description:P49768
Residue:467
BDBM50163314
NameBDBM50163314
Synonyms:CHEMBL3793083
TypeSmall organic molecule
Emp. Form.C19H22ClNO4S
Mol. Mass.395.9
SMILESCCC(CC)N(Cc1ccc(cc1)C(O)=O)S(=O)(=O)c1ccc(Cl)cc1