Reaction Details
TargetWD repeat-containing protein 5
LigandBDBM50164773
Substrate/Competitorn/a
Meas. Tech.ChEMBL_1575810 (CHEMBL3801642)
Kd 40±n/a nM
Citation Getlik, MSmil, DZepeda-Velázquez, CBolshan, YPoda, GWu, HDong, AKuznetsova, EMarcellus, RSenisterra, GDombrovski, LHajian, TKiyota, TSchapira, MArrowsmith, CHBrown, PJVedadi, MAl-Awar, R Structure-Based Optimization of a Small Molecule Antagonist of the Interaction Between WD Repeat-Containing Protein 5 (WDR5) and Mixed-Lineage Leukemia 1 (MLL1). J Med Chem59:2478-96 (2016) 
 
WD repeat-containing protein 5
Name:WD repeat-containing protein 5
Type:Protein
Mol. Mass.:36597.13
Organism:Homo sapiens (Human)
Description:P61964
Residue:334
BDBM50164773
NameBDBM50164773
Synonyms:CHEMBL3799127
TypeSmall organic molecule
Emp. Form.C24H24F3N5O2
Mol. Mass.471.4749
SMILESCN1CCN(CC1)c1ccc(cc1NC(=O)c1c[nH]c(=O)cc1C(F)(F)F)-c1ccc(N)cc1