Reaction Details
TargetWD repeat-containing protein 5
LigandBDBM50164785
Substrate/Competitorn/a
Meas. Tech.ChEMBL_1575810 (CHEMBL3801642)
Kd 210±n/a nM
Citation Getlik, MSmil, DZepeda-Velázquez, CBolshan, YPoda, GWu, HDong, AKuznetsova, EMarcellus, RSenisterra, GDombrovski, LHajian, TKiyota, TSchapira, MArrowsmith, CHBrown, PJVedadi, MAl-Awar, R Structure-Based Optimization of a Small Molecule Antagonist of the Interaction Between WD Repeat-Containing Protein 5 (WDR5) and Mixed-Lineage Leukemia 1 (MLL1). J Med Chem59:2478-96 (2016) 
 
WD repeat-containing protein 5
Name:WD repeat-containing protein 5
Type:Protein
Mol. Mass.:36597.13
Organism:Homo sapiens (Human)
Description:P61964
Residue:334
BDBM50164785
NameBDBM50164785
Synonyms:CHEMBL3797967
TypeSmall organic molecule
Emp. Form.C27H32F3N7O3
Mol. Mass.559.5833
SMILESCN1CCN(CC1)c1ccc(cc1NC(=O)c1c[nH]c(=O)cc1C(F)(F)F)-c1cnn(CCN2CCOCC2)c1