Reaction Details
TargetWD repeat-containing protein 5
LigandBDBM200712
Substrate/Competitorn/a
Meas. Tech.ChEMBL_1575811 (CHEMBL3801643)
IC50 2.9±n/a nM
Citation Getlik, MSmil, DZepeda-Velázquez, CBolshan, YPoda, GWu, HDong, AKuznetsova, EMarcellus, RSenisterra, GDombrovski, LHajian, TKiyota, TSchapira, MArrowsmith, CHBrown, PJVedadi, MAl-Awar, R Structure-Based Optimization of a Small Molecule Antagonist of the Interaction Between WD Repeat-Containing Protein 5 (WDR5) and Mixed-Lineage Leukemia 1 (MLL1). J Med Chem59:2478-96 (2016) 
 
WD repeat-containing protein 5
Name:WD repeat-containing protein 5
Type:Protein
Mol. Mass.:36597.13
Organism:Homo sapiens (Human)
Description:P61964
Residue:334
BDBM200712
NameBDBM200712
Synonyms:US9233086, 10A
TypeSmall organic molecule
Emp. Form.C35H51N7O4
Mol. Mass.633.8239
SMILESCCC(CC)(NC(=O)C(C)C)C(=O)N[C@@H](CCCNC(N)=N)C(=O)NC1(CCCC1)C(=O)NC(c1ccccc1)c1ccccc1