Reaction Details
TargetSerine/threonine-protein kinase B-raf
LigandBDBM50165856
Substrate/Competitorn/a
Meas. Tech.ChEMBL_1574501 (CHEMBL3804127)
IC50 6.0±n/a nM
Citation Liu, LLee, MRKim, JLWhittington, DABregman, HHua, ZLewis, RTMartin, MWNishimura, NPotashman, MYang, KYi, SVaida, KREpstein, LFBabij, CFernando, MCarnahan, JNorman, MH Purinylpyridinylamino-based DFG-in/aC-helix-out B-Raf inhibitors: Applying mutant versus wild-type B-Raf selectivity indices for compound profiling. Bioorg Med Chem24:2215-34 (2016) 
 
Serine/threonine-protein kinase B-raf
Name:Serine/threonine-protein kinase B-raf
Type:Serine/threonine-protein kinase
Mol. Mass.:84446.00
Organism:Homo sapiens (Human)
Description:P15056
Residue:766
BDBM50165856
NameBDBM50165856
Synonyms:CHEMBL3799342
TypeSmall organic molecule
Emp. Form.C21H21F2N7O2S
Mol. Mass.473.499
SMILESCC(C)(C)CS(=O)(=O)Nc1ccc(F)c(Nc2ncccc2-c2ncnc3[nH]cnc23)c1F