Reaction Details
TargetSerine/threonine-protein kinase B-raf
LigandBDBM50428286
Substrate/Competitorn/a
Meas. Tech.ChEMBL_1574500 (CHEMBL3804126)
IC50 0.400000±n/a nM
Citation Liu, LLee, MRKim, JLWhittington, DABregman, HHua, ZLewis, RTMartin, MWNishimura, NPotashman, MYang, KYi, SVaida, KREpstein, LFBabij, CFernando, MCarnahan, JNorman, MH Purinylpyridinylamino-based DFG-in/aC-helix-out B-Raf inhibitors: Applying mutant versus wild-type B-Raf selectivity indices for compound profiling. Bioorg Med Chem24:2215-34 (2016) 
 
Serine/threonine-protein kinase B-raf
Name:Serine/threonine-protein kinase B-raf
Type:Serine/threonine-protein kinase
Mol. Mass.:84446.00
Organism:Homo sapiens (Human)
Description:P15056
Residue:766
BDBM50428286
NameBDBM50428286
Synonyms:DABRAFENIB | GSK2118436A
TypeSmall organic molecule
Emp. Form.C23H20F3N5O2S2
Mol. Mass.519.562
SMILESCC(C)(C)c1nc(c(s1)-c1ccnc(N)n1)-c1cccc(NS(=O)(=O)c2c(F)cccc2F)c1F