Reaction Details
TargetSerine/threonine-protein kinase B-raf
LigandBDBM50165874
Substrate/Competitorn/a
Meas. Tech.ChEMBL_1574502 (CHEMBL3804128)
EC50 1450±n/a nM
Citation Liu, LLee, MRKim, JLWhittington, DABregman, HHua, ZLewis, RTMartin, MWNishimura, NPotashman, MYang, KYi, SVaida, KREpstein, LFBabij, CFernando, MCarnahan, JNorman, MH Purinylpyridinylamino-based DFG-in/aC-helix-out B-Raf inhibitors: Applying mutant versus wild-type B-Raf selectivity indices for compound profiling. Bioorg Med Chem24:2215-34 (2016) 
 
Serine/threonine-protein kinase B-raf
Name:Serine/threonine-protein kinase B-raf
Type:Serine/threonine-protein kinase
Mol. Mass.:84446.00
Organism:Homo sapiens (Human)
Description:P15056
Residue:766
BDBM50165874
NameBDBM50165874
Synonyms:CHEMBL3799488
TypeSmall organic molecule
Emp. Form.C20H19F2N7O2S
Mol. Mass.459.472
SMILESCC(C)CS(=O)(=O)Nc1ccc(F)c(Nc2ncccc2-c2ncnc3[nH]cnc23)c1F