Reaction Details
TargetSerine/threonine-protein kinase B-raf
LigandBDBM50165876
Substrate/Competitorn/a
Meas. Tech.ChEMBL_1574502 (CHEMBL3804128)
EC50 1800±n/a nM
Citation Liu, LLee, MRKim, JLWhittington, DABregman, HHua, ZLewis, RTMartin, MWNishimura, NPotashman, MYang, KYi, SVaida, KREpstein, LFBabij, CFernando, MCarnahan, JNorman, MH Purinylpyridinylamino-based DFG-in/aC-helix-out B-Raf inhibitors: Applying mutant versus wild-type B-Raf selectivity indices for compound profiling. Bioorg Med Chem24:2215-34 (2016) 
 
Serine/threonine-protein kinase B-raf
Name:Serine/threonine-protein kinase B-raf
Type:Serine/threonine-protein kinase
Mol. Mass.:84446.00
Organism:Homo sapiens (Human)
Description:P15056
Residue:766
BDBM50165876
NameBDBM50165876
Synonyms:CHEMBL3800364
TypeSmall organic molecule
Emp. Form.C21H19F2N7O2S
Mol. Mass.471.483
SMILESFc1ccc(NS(=O)(=O)C2CCCC2)c(F)c1Nc1ncccc1-c1ncnc2[nH]cnc12