Reaction Details
TargetSerine/threonine-protein kinase B-raf
LigandBDBM197692
Substrate/Competitorn/a
Meas. Tech.ChEMBL_1574502 (CHEMBL3804128)
EC50 3580±n/a nM
Citation Liu, LLee, MRKim, JLWhittington, DABregman, HHua, ZLewis, RTMartin, MWNishimura, NPotashman, MYang, KYi, SVaida, KREpstein, LFBabij, CFernando, MCarnahan, JNorman, MH Purinylpyridinylamino-based DFG-in/aC-helix-out B-Raf inhibitors: Applying mutant versus wild-type B-Raf selectivity indices for compound profiling. Bioorg Med Chem24:2215-34 (2016) 
 
Serine/threonine-protein kinase B-raf
Name:Serine/threonine-protein kinase B-raf
Type:Serine/threonine-protein kinase
Mol. Mass.:84446.00
Organism:Homo sapiens (Human)
Description:P15056
Residue:766
BDBM197692
NameBDBM197692
Synonyms:US9216981, 21
TypeSmall organic molecule
Emp. Form.C20H18F2N8O3S
Mol. Mass.488.471
SMILESFc1ccc(NS(=O)(=O)N2CCOCC2)c(F)c1Nc1ncccc1-c1ncnc2[nH]cnc12