Reaction Details
TargetSerine/threonine-protein kinase B-raf
LigandBDBM50165861
Substrate/Competitorn/a
Meas. Tech.ChEMBL_1574503 (CHEMBL3804129)
IC50 2.0±n/a nM
Citation Liu, LLee, MRKim, JLWhittington, DABregman, HHua, ZLewis, RTMartin, MWNishimura, NPotashman, MYang, KYi, SVaida, KREpstein, LFBabij, CFernando, MCarnahan, JNorman, MH Purinylpyridinylamino-based DFG-in/aC-helix-out B-Raf inhibitors: Applying mutant versus wild-type B-Raf selectivity indices for compound profiling. Bioorg Med Chem24:2215-34 (2016) 
 
Serine/threonine-protein kinase B-raf
Name:Serine/threonine-protein kinase B-raf
Type:Serine/threonine-protein kinase
Mol. Mass.:84446.00
Organism:Homo sapiens (Human)
Description:P15056
Residue:766
BDBM50165861
NameBDBM50165861
Synonyms:CHEMBL1197798
TypeSmall organic molecule
Emp. Form.C26H19ClN8
Mol. Mass.478.936
SMILESCc1ccc2c(Nc3ccc(Cl)cc3)nccc2c1Nc1ncccc1-c1ncnc2[nH]cnc12