Reaction Details
TargetSerine/threonine-protein kinase B-raf
LigandBDBM197714
Substrate/Competitorn/a
Meas. Tech.ChEMBL_1574503 (CHEMBL3804129)
IC50 710±n/a nM
Citation Liu, LLee, MRKim, JLWhittington, DABregman, HHua, ZLewis, RTMartin, MWNishimura, NPotashman, MYang, KYi, SVaida, KREpstein, LFBabij, CFernando, MCarnahan, JNorman, MH Purinylpyridinylamino-based DFG-in/aC-helix-out B-Raf inhibitors: Applying mutant versus wild-type B-Raf selectivity indices for compound profiling. Bioorg Med Chem24:2215-34 (2016) 
 
Serine/threonine-protein kinase B-raf
Name:Serine/threonine-protein kinase B-raf
Type:Serine/threonine-protein kinase
Mol. Mass.:84446.00
Organism:Homo sapiens (Human)
Description:P15056
Residue:766
BDBM197714
NameBDBM197714
Synonyms:US9216981, 43
TypeSmall organic molecule
Emp. Form.C20H15F2N9O2S
Mol. Mass.483.454
SMILESCn1cc(cn1)S(=O)(=O)Nc1ccc(F)c(Nc2ncccc2-c2ncnc3[nH]cnc23)c1F