Reaction Details
TargetVascular endothelial growth factor receptor 2
LigandBDBM50166609
Substrate/Competitorn/a
Meas. Tech.ChEMBL_1572794 (CHEMBL3804518)
IC50 36±n/a nM
Citation Fan, JDai, YShao, JPeng, XWang, CCao, SZhao, BAi, JGeng, MDuan, W Design, synthesis and biological evaluation of pyrazolylaminoquinazoline derivatives as highly potent pan-fibroblast growth factor receptor inhibitors. Bioorg Med Chem Lett26:2594-9 (2016) 
 
Vascular endothelial growth factor receptor 2
Name:Vascular endothelial growth factor receptor 2
Type:Receptor Tyrosine Kinase
Mol. Mass.:151510.97
Organism:Homo sapiens (Human)
Description:P35968
Residue:1356
BDBM50166609
NameBDBM50166609
Synonyms:CHEMBL3797416
TypeSmall organic molecule
Emp. Form.C29H37N7O2
Mol. Mass.515.6498
SMILESCCN1CCN(CC1)c1ccc2c(Nc3cc(CCc4cc(OC)cc(OC)c4)[nH]n3)nc(CC)nc2c1