Reaction Details
TargetFibroblast growth factor receptor 3
LigandBDBM50166610
Substrate/Competitorn/a
Meas. Tech.ChEMBL_1572806 (CHEMBL3804530)
IC50<0.200000±n/a nM
Citation Fan, JDai, YShao, JPeng, XWang, CCao, SZhao, BAi, JGeng, MDuan, W Design, synthesis and biological evaluation of pyrazolylaminoquinazoline derivatives as highly potent pan-fibroblast growth factor receptor inhibitors. Bioorg Med Chem Lett26:2594-9 (2016) 
 
Fibroblast growth factor receptor 3
Name:Fibroblast growth factor receptor 3
Type:Protein
Mol. Mass.:87699.57
Organism:Homo sapiens (Human)
Description:P22607
Residue:806
BDBM50166610
NameBDBM50166610
Synonyms:CHEMBL3800526
TypeSmall organic molecule
Emp. Form.C29H35N7O2
Mol. Mass.513.6339
SMILESCOc1cc(CCc2cc(Nc3ncnc4cc(ccc34)N3CCN4CCCCC4C3)n[nH]2)cc(OC)c1