Reaction Details
TargetFibroblast growth factor receptor 2
LigandBDBM50166773
Substrate/Competitorn/a
Meas. Tech.ChEMBL_1572613 (CHEMBL3803146)
IC50 4.3±n/a nM
Citation Fan, JDai, YShao, JPeng, XWang, CCao, SZhao, BAi, JGeng, MDuan, W Design, synthesis and biological evaluation of pyrazolylaminoquinazoline derivatives as highly potent pan-fibroblast growth factor receptor inhibitors. Bioorg Med Chem Lett26:2594-9 (2016) 
 
Fibroblast growth factor receptor 2
Name:Fibroblast growth factor receptor 2
Type:Enzyme
Mol. Mass.:92015.45
Organism:Homo sapiens (Human)
Description:P21802
Residue:821
BDBM50166773
NameBDBM50166773
Synonyms:CHEMBL3798127
TypeSmall organic molecule
Emp. Form.C27H33N7O2
Mol. Mass.487.5966
SMILESCCN1CCN(CC1)c1cccc2c(Nc3cc(CCc4cc(OC)cc(OC)c4)[nH]n3)ncnc12