Reaction Details
TargetFibroblast growth factor receptor 2
LigandBDBM50166780
Substrate/Competitorn/a
Meas. Tech.ChEMBL_1572613 (CHEMBL3803146)
IC50 17±n/a nM
Citation Fan, JDai, YShao, JPeng, XWang, CCao, SZhao, BAi, JGeng, MDuan, W Design, synthesis and biological evaluation of pyrazolylaminoquinazoline derivatives as highly potent pan-fibroblast growth factor receptor inhibitors. Bioorg Med Chem Lett26:2594-9 (2016) 
 
Fibroblast growth factor receptor 2
Name:Fibroblast growth factor receptor 2
Type:Enzyme
Mol. Mass.:92015.45
Organism:Homo sapiens (Human)
Description:P21802
Residue:821
BDBM50166780
NameBDBM50166780
Synonyms:CHEMBL3799024
TypeSmall organic molecule
Emp. Form.C21H20ClN5O2
Mol. Mass.409.869
SMILESCOc1cc(CCc2cc(Nc3ncnc4cccc(Cl)c34)n[nH]2)cc(OC)c1