Reaction Details
TargetFibroblast growth factor receptor 2
LigandBDBM50166781
Substrate/Competitorn/a
Meas. Tech.ChEMBL_1572613 (CHEMBL3803146)
IC50 3.2±n/a nM
Citation Fan, JDai, YShao, JPeng, XWang, CCao, SZhao, BAi, JGeng, MDuan, W Design, synthesis and biological evaluation of pyrazolylaminoquinazoline derivatives as highly potent pan-fibroblast growth factor receptor inhibitors. Bioorg Med Chem Lett26:2594-9 (2016) 
 
Fibroblast growth factor receptor 2
Name:Fibroblast growth factor receptor 2
Type:Enzyme
Mol. Mass.:92015.45
Organism:Homo sapiens (Human)
Description:P21802
Residue:821
BDBM50166781
NameBDBM50166781
Synonyms:CHEMBL3797268
TypeSmall organic molecule
Emp. Form.C21H21N5O2
Mol. Mass.375.4237
SMILESCOc1cc(CCc2cc(Nc3ncnc4ccccc34)n[nH]2)cc(OC)c1