Reaction Details
TargetFibroblast growth factor receptor 2
LigandBDBM50166778
Substrate/Competitorn/a
Meas. Tech.ChEMBL_1572615 (CHEMBL3803148)
IC50>200±n/a nM
Citation Fan, JDai, YShao, JPeng, XWang, CCao, SZhao, BAi, JGeng, MDuan, W Design, synthesis and biological evaluation of pyrazolylaminoquinazoline derivatives as highly potent pan-fibroblast growth factor receptor inhibitors. Bioorg Med Chem Lett26:2594-9 (2016) 
 
Fibroblast growth factor receptor 2
Name:Fibroblast growth factor receptor 2
Type:Enzyme
Mol. Mass.:92015.45
Organism:Homo sapiens (Human)
Description:P21802
Residue:821
BDBM50166778
NameBDBM50166778
Synonyms:CHEMBL3799140
TypeSmall organic molecule
Emp. Form.C21H20ClN5O2
Mol. Mass.409.869
SMILESCOc1cc(CCc2cc(Nc3ncnc4c(Cl)cccc34)n[nH]2)cc(OC)c1