Reaction Details
TargetFibroblast growth factor receptor 2
LigandBDBM50166738
Substrate/Competitorn/a
Meas. Tech.ChEMBL_1572615 (CHEMBL3803148)
IC50 18±n/a nM
Citation Fan, JDai, YShao, JPeng, XWang, CCao, SZhao, BAi, JGeng, MDuan, W Design, synthesis and biological evaluation of pyrazolylaminoquinazoline derivatives as highly potent pan-fibroblast growth factor receptor inhibitors. Bioorg Med Chem Lett26:2594-9 (2016) 
 
Fibroblast growth factor receptor 2
Name:Fibroblast growth factor receptor 2
Type:Enzyme
Mol. Mass.:92015.45
Organism:Homo sapiens (Human)
Description:P21802
Residue:821
BDBM50166738
NameBDBM50166738
Synonyms:CHEMBL3797845
TypeSmall organic molecule
Emp. Form.C28H35N7O2
Mol. Mass.501.6232
SMILESCOc1cc(CCc2cc(Nc3ncnc4cc(ccc34)N3CCC(CC3)N(C)C)n[nH]2)cc(OC)c1