Reaction Details
TargetBeta-secretase 1
LigandBDBM50169351
Substrate/Competitorn/a
Meas. Tech.ChEMBL_1577901 (CHEMBL3806438)
IC50 0.700000±n/a nM
Citation Wu, YJGuernon, JYang, FSnyder, LShi, JMcclure, ARajamani, RPark, HNg, ALewis, HChang, CCamac, DToyn, JHAhlijanian, MKAlbright, CFMacor, JEThompson, LA Targeting the BACE1 Active Site Flap Leads to a Potent Inhibitor That Elicits Robust Brain Aß Reduction in Rodents. ACS Med Chem Lett7:271-6 (2016) 
 
Beta-secretase 1
Name:Beta-secretase 1
Type:Protein
Mol. Mass.:55755.10
Organism:Homo sapiens (Human)
Description:P56817
Residue:501
BDBM50169351
NameBDBM50169351
Synonyms:CHEMBL3805852
TypeSmall organic molecule
Emp. Form.C22H22F2N6O3S
Mol. Mass.488.51
SMILESCOc1cnc(cn1)C(=O)Nc1cc(F)c(F)c(c1)[C@]1(C)C[C@H](SC(N)=N1)c1c(C)noc1C