Reaction Details
TargetMycocyclosin synthase
LigandBDBM31772
Substrate/Competitorn/a
Meas. Tech.ChEMBL_1576820 (CHEMBL3806366)
Kd 73±n/a nM
Citation Kavanagh, MECoyne, AGMcLean, KJJames, GGLevy, CWMarino, LBde Carvalho, LPChan, DSHudson, SASurade, SLeys, DMunro, AWAbell, C Fragment-Based Approaches to the Development of Mycobacterium tuberculosis CYP121 Inhibitors. J Med Chem59:3272-302 (2016) 
 
Mycocyclosin synthase
Name:Mycocyclosin synthase
Type:PROTEIN
Mol. Mass.:43255.98
Organism:Mycobacterium tuberculosis
Description:ChEMBL_721243
Residue:396
BDBM31772
NameBDBM31772
Synonyms:1-[2-(2,4-dichlorobenzyl)oxy-2-(2,4-dichlorophenyl)ethyl]imidazole;nitric acid CHEMBL91 Miconazole US9144538, Miconazole Nitrate | cid_4189
TypeSmall organic molecule
Emp. Form.C18H14Cl4N2O
Mol. Mass.416.129
SMILESClc1ccc(COC(Cn2ccnc2)c2ccc(Cl)cc2Cl)c(Cl)c1