Reaction Details
TargetDipeptidyl peptidase 4
LigandBDBM50170920
Substrate/Competitorn/a
Meas. Tech.ChEMBL_1578293 (CHEMBL3807661)
IC50 0.700000±n/a nM
Citation Cox, JMChu, HDKuethe, JTGao, YDScapin, GEiermann, GHe, HLi, XLyons, KAMetzger, JPetrov, AWu, JKXu, SSinha-Roy, RWeber, AEBiftu, T The discovery of novel 5,6,5- and 5,5,6-tricyclic pyrrolidines as potent and selective DPP-4 inhibitors. Bioorg Med Chem Lett26:2622-6 (2016) 
 
Dipeptidyl peptidase 4
Name:Dipeptidyl peptidase 4
Type:Enzyme
Mol. Mass.:88271.01
Organism:Homo sapiens (Human)
Description:P27487
Residue:766
BDBM50170920
NameBDBM50170920
Synonyms:CHEMBL3806029
TypeSmall organic molecule
Emp. Form.C20H20F3N5O
Mol. Mass.403.4009
SMILESCc1cc2ncc3CN(Cc3n2n1)[C@H]1CO[C@@H]([C@@H](N)C1)c1cc(F)c(F)cc1F