Reaction Details
TargetDipeptidyl peptidase 4
LigandBDBM50170957
Substrate/Competitorn/a
Meas. Tech.ChEMBL_1578293 (CHEMBL3807661)
IC50 0.600000±n/a nM
Citation Cox, JMChu, HDKuethe, JTGao, YDScapin, GEiermann, GHe, HLi, XLyons, KAMetzger, JPetrov, AWu, JKXu, SSinha-Roy, RWeber, AEBiftu, T The discovery of novel 5,6,5- and 5,5,6-tricyclic pyrrolidines as potent and selective DPP-4 inhibitors. Bioorg Med Chem Lett26:2622-6 (2016) 
 
Dipeptidyl peptidase 4
Name:Dipeptidyl peptidase 4
Type:Enzyme
Mol. Mass.:88271.01
Organism:Homo sapiens (Human)
Description:P27487
Residue:766
BDBM50170957
NameBDBM50170957
Synonyms:CHEMBL3806157
TypeSmall organic molecule
Emp. Form.C21H23F2N5
Mol. Mass.383.4376
SMILESCc1cc2ncc3CN(Cc3n2n1)[C@H]1CC[C@@H]([C@@H](N)C1)c1cc(F)ccc1F