Reaction Details
TargetAcyl-protein thioesterase 1
LigandBDBM50170922
Substrate/Competitorn/a
Meas. Tech.ChEMBL_1578295 (CHEMBL3807663)
IC50 450±n/a nM
Citation Cox, JMChu, HDKuethe, JTGao, YDScapin, GEiermann, GHe, HLi, XLyons, KAMetzger, JPetrov, AWu, JKXu, SSinha-Roy, RWeber, AEBiftu, T The discovery of novel 5,6,5- and 5,5,6-tricyclic pyrrolidines as potent and selective DPP-4 inhibitors. Bioorg Med Chem Lett26:2622-6 (2016) 
 
Acyl-protein thioesterase 1
Name:Acyl-protein thioesterase 1
Type:PROTEIN
Mol. Mass.:24708.49
Organism:Rattus norvegicus
Description:ChEMBL_12731
Residue:230
BDBM50170922
NameBDBM50170922
Synonyms:CHEMBL3805629
TypeSmall organic molecule
Emp. Form.C20H21F3N6
Mol. Mass.402.4161
SMILESCc1nc2ncc3CN(Cc3n2n1)[C@H]1CC[C@@H]([C@@H](N)C1)c1cc(F)c(F)cc1F