Reaction Details
TargetCytochrome P450 2C9
LigandBDBM50170939
Substrate/Competitorn/a
Meas. Tech.ChEMBL_1578314 (CHEMBL3807777)
IC50>50000±n/a nM
Citation Cox, JMChu, HDKuethe, JTGao, YDScapin, GEiermann, GHe, HLi, XLyons, KAMetzger, JPetrov, AWu, JKXu, SSinha-Roy, RWeber, AEBiftu, T The discovery of novel 5,6,5- and 5,5,6-tricyclic pyrrolidines as potent and selective DPP-4 inhibitors. Bioorg Med Chem Lett26:2622-6 (2016) 
 
Cytochrome P450 2C9
Name:Cytochrome P450 2C9
Type:Enzyme
Mol. Mass.:55636.33
Organism:Homo sapiens (Human)
Description:P11712
Residue:490
BDBM50170939
NameBDBM50170939
Synonyms:CHEMBL3806052
TypeSmall organic molecule
Emp. Form.C18H18F2N6O
Mol. Mass.372.3719
SMILESN[C@H]1C[C@H](CO[C@@H]1c1cc(F)ccc1F)N1Cc2nn3nccnc3c2C1