Reaction Details
TargetCasein kinase II subunit alpha
LigandBDBM50172249
Substrate/Competitorn/a
Meas. Tech.ChEMBL_1579153 (CHEMBL3811873)
IC50<3.0±n/a nM
Citation Dowling, JEAlimzhanov, MBao, LChuaqui, CDenz, CRJenkins, ELarsen, NALyne, PDPontz, TYe, QHoldgate, GASnow, LO'Connell, NFerguson, AD Potent and Selective CK2 Kinase Inhibitors with Effects on Wnt Pathway Signaling in Vivo. ACS Med Chem Lett7:300-5 (2016) 
 
Casein kinase II subunit alpha
Name:Casein kinase II subunit alpha
Type:Enzyme
Mol. Mass.:45151.12
Organism:Homo sapiens (Human)
Description:P68400
Residue:391
BDBM50172249
NameBDBM50172249
Synonyms:CHEMBL3809915
TypeSmall organic molecule
Emp. Form.C22H27N9O
Mol. Mass.433.5095
SMILESC[C@H](N)CN(C)c1ccc(Nc2cc(NC3CC3)n3ncc(C#N)c3n2)cc1NC(C)=O