Reaction Details
TargetG protein-coupled receptor kinase 5
LigandBDBM50173315
Substrate/Competitorn/a
Meas. Tech.ChEMBL_1581285 (CHEMBL3811362)
IC50 800±n/a nM
Citation Waldschmidt, HVHoman, KTCruz-Rodríguez, OCato, MCWaninger-Saroni, JLarimore, KMCannavo, ASong, JCheung, JYKirchhoff, PDKoch, WJTesmer, JJLarsen, SD Structure-Based Design, Synthesis, and Biological Evaluation of Highly Selective and Potent G Protein-Coupled Receptor Kinase 2 Inhibitors. J Med Chem59:3793-807 (2016) 
 
G protein-coupled receptor kinase 5
Name:G protein-coupled receptor kinase 5
Type:PROTEIN
Mol. Mass.:67798.93
Organism:Homo sapiens (Human)
Description:ChEMBL_1280627
Residue:590
BDBM50173315
NameBDBM50173315
Synonyms:CHEMBL3809100 | US10023564, Example 4
TypeSmall organic molecule
Emp. Form.C27H22F2N6O3
Mol. Mass.516.4988
SMILESCC1=C(C(NC(=O)N1)c1ccc(F)c(c1)C(=O)NCc1cccc(F)c1)C(=O)Nc1ccc2[nH]ncc2c1