Reaction Details
TargetG protein-coupled receptor kinase 5
LigandBDBM50173324
Substrate/Competitorn/a
Meas. Tech.ChEMBL_1581285 (CHEMBL3811362)
IC50>100000±n/a nM
Citation Waldschmidt, HVHoman, KTCruz-Rodríguez, OCato, MCWaninger-Saroni, JLarimore, KMCannavo, ASong, JCheung, JYKirchhoff, PDKoch, WJTesmer, JJLarsen, SD Structure-Based Design, Synthesis, and Biological Evaluation of Highly Selective and Potent G Protein-Coupled Receptor Kinase 2 Inhibitors. J Med Chem59:3793-807 (2016) 
 
G protein-coupled receptor kinase 5
Name:G protein-coupled receptor kinase 5
Type:PROTEIN
Mol. Mass.:67798.93
Organism:Homo sapiens (Human)
Description:ChEMBL_1280627
Residue:590
BDBM50173324
NameBDBM50173324
Synonyms:CHEMBL3809124 | US10023564, Example 30
TypeSmall organic molecule
Emp. Form.C30H29FN6O5
Mol. Mass.572.5869
SMILESCOc1cccc(OC)c1CNC(=O)Cc1cc(ccc1F)C1NC(=O)NC(C)=C1C(=O)Nc1ccc2[nH]ncc2c1