Reaction Details
TargetRho-associated protein kinase 1
LigandBDBM50173307
Substrate/Competitorn/a
Meas. Tech.ChEMBL_1581288 (CHEMBL3811365)
IC50 12±n/a nM
Citation Waldschmidt, HVHoman, KTCruz-Rodríguez, OCato, MCWaninger-Saroni, JLarimore, KMCannavo, ASong, JCheung, JYKirchhoff, PDKoch, WJTesmer, JJLarsen, SD Structure-Based Design, Synthesis, and Biological Evaluation of Highly Selective and Potent G Protein-Coupled Receptor Kinase 2 Inhibitors. J Med Chem59:3793-807 (2016) 
 
Rho-associated protein kinase 1
Name:Rho-associated protein kinase 1
Type:Serine/threonine-protein kinase
Mol. Mass.:158156.77
Organism:Homo sapiens (Human)
Description:Q13464
Residue:1354
BDBM50173307
NameBDBM50173307
Synonyms:CHEMBL3809796 | US10023564, Example 8
TypeSmall organic molecule
Emp. Form.C30H24FN7O3
Mol. Mass.549.5551
SMILESCC1=C(C(NC(=O)N1)c1ccc(F)c(c1)C(=O)NCc1nccc2ccccc12)C(=O)Nc1ccc2[nH]ncc2c1