Reaction Details
TargetRho-associated protein kinase 1
LigandBDBM50173323
Substrate/Competitorn/a
Meas. Tech.ChEMBL_1581288 (CHEMBL3811365)
IC50 110±n/a nM
Citation Waldschmidt, HVHoman, KTCruz-Rodríguez, OCato, MCWaninger-Saroni, JLarimore, KMCannavo, ASong, JCheung, JYKirchhoff, PDKoch, WJTesmer, JJLarsen, SD Structure-Based Design, Synthesis, and Biological Evaluation of Highly Selective and Potent G Protein-Coupled Receptor Kinase 2 Inhibitors. J Med Chem59:3793-807 (2016) 
 
Rho-associated protein kinase 1
Name:Rho-associated protein kinase 1
Type:Serine/threonine-protein kinase
Mol. Mass.:158156.77
Organism:Homo sapiens (Human)
Description:Q13464
Residue:1354
BDBM50173323
NameBDBM50173323
Synonyms:CHEMBL3808621 | US10023564, Example 2
TypeSmall organic molecule
Emp. Form.C27H21F3N6O3
Mol. Mass.534.4892
SMILESCC1=C(C(NC(=O)N1)c1ccc(F)c(c1)C(=O)NCc1c(F)cccc1F)C(=O)Nc1ccc2[nH]ncc2c1