Reaction Details
TargetEpidermal growth factor receptor
LigandBDBM3294
Substrate/Competitorn/a
Meas. Tech.ChEMBL_1580544 (CHEMBL3813356)
IC50 6100±n/a nM
Citation Tarozzi, AMarchetti, CNicolini, BD'Amico, MTicchi, NPruccoli, LTumiatti, VSimoni, ELodola, AMor, MMilelli, AMinarini, A Combined inhibition of the EGFR/AKT pathways by a novel conjugate of quinazoline with isothiocyanate. Eur J Med Chem117:283-91 (2016) 
 
Epidermal growth factor receptor
Name:Epidermal growth factor receptor
Type:Receptor Kinase Domain
Mol. Mass.:134279.59
Organism:Homo sapiens (Human)
Description:P00533
Residue:1210
BDBM3294
NameBDBM3294
Synonyms:4-Anilinoquinazoline deriv. 45 Anilinoquinazoline, 4b | CHEMBL52765
TypeSmall organic molecule
Emp. Form.C14H11BrN4
Mol. Mass.315.168
SMILESNc1ccc2ncnc(Nc3cccc(Br)c3)c2c1