Reaction Details
TargetRap guanine nucleotide exchange factor 4
LigandBDBM50011360
Substrate/Competitorn/a
Meas. Tech.ChEMBL_1580632 (CHEMBL3810794)
IC50 4400±n/a nM
Citation Wild, CTZhu, YNa, YMei, FYnalvez, MAChen, HCheng, XZhou, J Functionalized N,N-Diphenylamines as Potent and Selective EPAC2 Inhibitors. ACS Med Chem Lett7:460-4 (2016) 
 
Rap guanine nucleotide exchange factor 4
Name:Rap guanine nucleotide exchange factor 4
Type:PROTEIN
Mol. Mass.:115526.83
Organism:Homo sapiens (Human)
Description:ChEMBL_1504794
Residue:1011
BDBM50011360
NameBDBM50011360
Synonyms:CHEMBL3260990
TypeSmall organic molecule
Emp. Form.C16H15ClN4O2
Mol. Mass.330.769
SMILESCC(C)(C)c1cc(no1)C(=O)C(=N\Nc1cccc(Cl)c1)\C#N