Reaction Details
TargetRap guanine nucleotide exchange factor 4
LigandBDBM50175226
Substrate/Competitorn/a
Meas. Tech.ChEMBL_1580631 (CHEMBL3810793)
IC50 3600±n/a nM
Citation Wild, CTZhu, YNa, YMei, FYnalvez, MAChen, HCheng, XZhou, J Functionalized N,N-Diphenylamines as Potent and Selective EPAC2 Inhibitors. ACS Med Chem Lett7:460-4 (2016) 
 
Rap guanine nucleotide exchange factor 4
Name:Rap guanine nucleotide exchange factor 4
Type:PROTEIN
Mol. Mass.:115526.83
Organism:Homo sapiens (Human)
Description:ChEMBL_1504794
Residue:1011
BDBM50175226
NameBDBM50175226
Synonyms:CHEMBL3808936
TypeSmall organic molecule
Emp. Form.C16H18ClN
Mol. Mass.259.774
SMILESCc1cc(C)c(Nc2cccc(Cl)c2C)c(C)c1