Reaction Details
TargetRap guanine nucleotide exchange factor 4
LigandBDBM50175258
Substrate/Competitorn/a
Meas. Tech.ChEMBL_1580630 (CHEMBL3810792)
IC50 3300±n/a nM
Citation Wild, CTZhu, YNa, YMei, FYnalvez, MAChen, HCheng, XZhou, J Functionalized N,N-Diphenylamines as Potent and Selective EPAC2 Inhibitors. ACS Med Chem Lett7:460-4 (2016) 
 
Rap guanine nucleotide exchange factor 4
Name:Rap guanine nucleotide exchange factor 4
Type:PROTEIN
Mol. Mass.:115526.83
Organism:Homo sapiens (Human)
Description:ChEMBL_1504794
Residue:1011
BDBM50175258
NameBDBM50175258
Synonyms:CHEMBL3810188
TypeSmall organic molecule
Emp. Form.C15H15ClFN
Mol. Mass.263.738
SMILESCc1cc(C)c(Nc2ccc(Cl)c(F)c2)c(C)c1