Reaction Details
TargetRap guanine nucleotide exchange factor 4
LigandBDBM50175271
Substrate/Competitorn/a
Meas. Tech.ChEMBL_1580630 (CHEMBL3810792)
IC50 3000±n/a nM
Citation Wild, CTZhu, YNa, YMei, FYnalvez, MAChen, HCheng, XZhou, J Functionalized N,N-Diphenylamines as Potent and Selective EPAC2 Inhibitors. ACS Med Chem Lett7:460-4 (2016) 
 
Rap guanine nucleotide exchange factor 4
Name:Rap guanine nucleotide exchange factor 4
Type:PROTEIN
Mol. Mass.:115526.83
Organism:Homo sapiens (Human)
Description:ChEMBL_1504794
Residue:1011
BDBM50175271
NameBDBM50175271
Synonyms:CHEMBL3809245
TypeSmall organic molecule
Emp. Form.C15H14F3N
Mol. Mass.265.2736
SMILESCc1cc(C)c(Nc2cc(F)c(F)c(F)c2)c(C)c1