Reaction Details
TargetCytochrome P450 3A4
LigandBDBM50417104
Substrate/Competitorn/a
Meas. Tech.ChEMBL_1581632 (CHEMBL3817395)
Kd 2500000±n/a nM
Citation Kaur, PChamberlin, ARPoulos, TLSevrioukova, IF Structure-Based Inhibitor Design for Evaluation of a CYP3A4 Pharmacophore Model. J Med Chem59:4210-20 (2016) 
 
Cytochrome P450 3A4
Name:Cytochrome P450 3A4
Type:Enzyme
Mol. Mass.:57349.57
Organism:Homo sapiens (Human)
Description:n/a
Residue:503
BDBM50417104
NameBDBM50417104
Synonyms:CHEMBL1256004
TypeSmall organic molecule
Emp. Form.C7H10N2
Mol. Mass.122.1677
SMILESNCCc1cccnc1