Reaction Details
TargetPhosphatidylinositol 4,5-bisphosphate 3-kinase catalytic subunit alpha isoform
LigandBDBM50398399
Substrate/Competitorn/a
Meas. Tech.ChEMBL_1581735 (CHEMBL3816166)
Ki 2.0±n/a nM
Citation Heffron, TPNdubaku, COSalphati, LAlicke, BCheong, JDrobnick, JEdgar, KGould, SELee, LBLesnick, JDLewis, CNonomiya, JPang, JPlise, EGSideris, SWallin, JWang, LZhang, XOlivero, AG Discovery of Clinical Development Candidate GDC-0084, a Brain Penetrant Inhibitor of PI3K and mTOR. ACS Med Chem Lett7:351-6 (2016) 
 
Phosphatidylinositol 4,5-bisphosphate 3-kinase catalytic subunit alpha isoform
Name:Phosphatidylinositol 4,5-bisphosphate 3-kinase catalytic subunit alpha isoform
Type:Enzyme Subunit
Mol. Mass.:124294.87
Organism:Homo sapiens (Human)
Description:P42336
Residue:1068
BDBM50398399
NameBDBM50398399
Synonyms:CHEMBL2178608
TypeSmall organic molecule
Emp. Form.C19H22N6O3S
Mol. Mass.414.481
SMILESCOC1(COC1)c1sc2c(nc(nc2c1C)-c1cnc(N)nc1)N1CCOCC1