Reaction Details
TargetCathepsin E
LigandBDBM912
Substrate/Competitorn/a
Meas. Tech.ChEMBL_1582465 (CHEMBL3816586)
IC50 0.080000±n/a nM
Citation Al-Awadhi, FHRatnayake, RPaul, VJLuesch, H Tasiamide F, a potent inhibitor of cathepsins D and E from a marine cyanobacterium. Bioorg Med Chem24:3276-82 (2016) 
 
Cathepsin E
Name:Cathepsin E
Type:Enzyme
Mol. Mass.:43298.99
Organism:Homo sapiens (Human)
Description:P14091
Residue:396
BDBM912
NameBDBM912
Synonyms:(3S,4S)-3-hydroxy-4-[(2S)-2-[(3S,4S)-3-hydroxy-6-methyl-4-[(2S)-3-methyl-2-[(2S)-3-methyl-2-(3-methylbutanamido)butanamido]butanamido]heptanamido]propanamido]-6-methylheptanoic acid Iva-Val-Val-Sta-Ala-Sta-OH PEPSTATIN US9115083, Pepstatin
TypeSmall organic molecule
Emp. Form.C34H63N5O9
Mol. Mass.685.8921
SMILESCC(C)C[C@H](NC(=O)[C@H](C)NC(=O)C[C@H](O)[C@H](CC(C)C)NC(=O)[C@@H](NC(=O)[C@@H](NC(=O)CC(C)C)C(C)C)C(C)C)[C@@H](O)CC(O)=O