Reaction Details
Target3-phosphoinositide-dependent protein kinase 1
LigandBDBM50178291
Substrate/Competitorn/a
Meas. Tech.ChEMBL_1583663 (CHEMBL3815750)
IC50 58±n/a nM
Citation Wucherer-Plietker, MMerkul, EMüller, TJEsdar, CKnöchel, THeinrich, TBuchstaller, HPGreiner, HDorsch, DFinsinger, DCalderini, MBruge, DGrädler, U Discovery of novel 7-azaindoles as PDK1 inhibitors. Bioorg Med Chem Lett26:3073-80 (2016) 
 
3-phosphoinositide-dependent protein kinase 1
Name:3-phosphoinositide-dependent protein kinase 1
Type:Enzyme
Mol. Mass.:63157.65
Organism:Homo sapiens (Human)
Description:O15530
Residue:556
BDBM50178291
NameBDBM50178291
Synonyms:CHEMBL3814140
TypeSmall organic molecule
Emp. Form.C21H24N8
Mol. Mass.388.4689
SMILESCCc1cc(nc(N)n1)-c1c[nH]c2ncc(cc12)-c1cnn(c1)C1CCNCC1